Target
Glycogen synthase kinase-3 beta
Ligand
BDBM50397769
Substrate
Meas. Tech.
ChEMBL_874339 (CHEMBL2182637)
Ki
300±n/a nM
Citation
 Berg, SBergh, MHellberg, SHögdin, KLo-Alfredsson, YSöderman, Pvon Berg, SWeigelt, TOrmö, MXue, YTucker, JNeelissen, JJerning, ENilsson, YBhat, R Discovery of novel potent and highly selective glycogen synthase kinase-3ß (GSK3ß) inhibitors for Alzheimer's disease: design, synthesis, and characterization of pyrazines. J Med Chem 55:9107-19 (2012)  
Target
Name:
Glycogen synthase kinase-3 beta
Synonyms:
GSK-3 beta GSK3B Glycogen synthase kinase 3 beta (GSK3B) Glycogen synthase kinase-3 beta (GSK-3B) Glycogen synthase kinase-3 beta (GSK3B) Glycogen synthase kinase-3beta (GSK3B) | Serine/threonine-protein kinase GSK3B
Type:
Enzyme
Mol. Mass.:
46756.38
Organism:
Homo sapiens (Human)
Description:
P49841
Residue:
420
  
Inhibitor
Name:
BDBM50397769
Synonyms:
CHEMBL2182000
Type:
Small organic molecule
Emp. Form.:
C21H23N7O3S
Mol. Mass.:
453.517
SMILES:
CN1CCN(CC1)S(=O)(=O)c1ccccc1-c1cnc(N)c(n1)C(=O)Nc1cccnc1
: