Target
RAC-gamma serine/threonine-protein kinase
Ligand
BDBM50397788
Substrate
Meas. Tech.
ChEMBL_874589 (CHEMBL2186225)
IC50
22000±n/a nM
Citation
 Ashwell, MALapierre, JMBrassard, CBresciano, KBull, CCornell-Kennon, SEathiraj, SFrance, DSHall, THill, JKelleher, EKhanapurkar, SKizer, DKoerner, SLink, JLiu, YMakhija, SMoussa, MNamdev, NNguyen, KNicewonger, RPalma, RSzwaya, JTandon, MUppalapati, UVensel, DVolak, LPVolckova, EWestlund, NWu, HYang, RYChan, TC Discovery and optimization of a series of 3-(3-phenyl-3H-imidazo[4,5-b]pyridin-2-yl)pyridin-2-amines: orally bioavailable, selective, and potent ATP-independent Akt inhibitors. J Med Chem 55:5291-310 (2012)  
Target
Name:
RAC-gamma serine/threonine-protein kinase
Synonyms:
AKT3 PKB gamma Protein kinase Akt-3 Protein kinase B, gamma RAC-gamma serine/threonine-protein kinase Serine/threonine-protein kinase AKT | Serine/threonine-protein kinase AKT3
Type:
Enzyme
Mol. Mass.:
55769.36
Organism:
Homo sapiens (Human)
Description:
Residue:
479
  
Inhibitor
Name:
BDBM50397788
Synonyms:
CHEMBL2177818
Type:
Small organic molecule
Emp. Form.:
C25H20N6O
Mol. Mass.:
420.4659
SMILES:
Nc1ncccc1-c1nc2cccnc2n1-c1ccc(CC(=O)Nc2ccccc2)cc1
: