Target
High affinity cGMP-specific 3',5'-cyclic phosphodiesterase 9A
Ligand
BDBM50397849
Substrate
Meas. Tech.
ChEMBL_876339 (CHEMBL2185813)
IC50
152±n/a nM
Citation
 Verhoest, PRFonseca, KRHou, XProulx-Lafrance, CCorman, MHelal, CJClaffey, MMTuttle, JBCoffman, KJLiu, SNelson, FKleiman, RJMenniti, FSSchmidt, CJVanase-Frawley, MLiras, S Design and discovery of 6-[(3S,4S)-4-methyl-1-(pyrimidin-2-ylmethyl)pyrrolidin-3-yl]-1-(tetrahydro-2H-pyran-4-yl)-1,5-dihydro-4H-pyrazolo[3,4-d]pyrimidin-4-one (PF-04447943), a selective brain penetrant PDE9A inhibitor for the treatment of cognitive disorders. J Med Chem 55:9045-54 (2012)  
Target
Name:
High affinity cGMP-specific 3',5'-cyclic phosphodiesterase 9A
Synonyms:
3',5'-cyclic phosphodiesterase PDE9A_HUMAN Phosphodiesterase 9A (PDE9) | Phosphodiesterase 9A (PDE9A)
Type:
Protein
Mol. Mass.:
68488.40
Organism:
Homo sapiens (Human)
Description:
O76083
Residue:
593
  
Inhibitor
Name:
BDBM50397849
Synonyms:
CHEMBL2179095
Type:
Small organic molecule
Emp. Form.:
C22H27N5O2
Mol. Mass.:
393.4821
SMILES:
C[C@H]1CN(Cc2ccccc2)C[C@@H]1c1nc2n(ncc2c(=O)[nH]1)C1CCOCC1
: