Target
Aminopeptidase N
Ligand
BDBM50397953
Substrate
Meas. Tech.
ChEMBL_872716 (CHEMBL2185129)
Ki
60±n/a nM
Citation
 Albrecht, SSalomon, EDefoin, ATarnus, C Rapid and efficient synthesis of a novel series of substituted aminobenzosuberone derivatives as potent, selective, non-peptidic neutral aminopeptidase inhibitors. Bioorg Med Chem 20:4942-53 (2012)  
Target
Name:
Aminopeptidase N
Synonyms:
AMPN_PIG AP-M Alanyl aminopeptidase Aminopeptidase N (APN) Microsomal aminopeptidase pAPN
Type:
Protein
Mol. Mass.:
108810.25
Organism:
Sus scrofa (Pig)
Description:
P15145
Residue:
963
  
Inhibitor
Name:
BDBM50397953
Synonyms:
CHEMBL2179978
Type:
Small organic molecule
Emp. Form.:
C17H17NOS
Mol. Mass.:
283.388
SMILES:
N[C@H]1CCc2ccccc2[C@H](Sc2ccccc2)C1=O
: