Target
Cytosol aminopeptidase
Ligand
BDBM23973
Substrate
Meas. Tech.
ChEMBL_872713 (CHEMBL2185126)
Ki
>1000000±n/a nM
Citation
 Albrecht, SSalomon, EDefoin, ATarnus, C Rapid and efficient synthesis of a novel series of substituted aminobenzosuberone derivatives as potent, selective, non-peptidic neutral aminopeptidase inhibitors. Bioorg Med Chem 20:4942-53 (2012)  
Target
Name:
Cytosol aminopeptidase
Synonyms:
AMPL_BOVIN LAP3 Leucine Aminopeptidase | Leucyl aminopeptidase
Type:
Homohexamer
Mol. Mass.:
56288.28
Organism:
Bos taurus (bovine)
Description:
Bovine kidney LAPc was purchased from Sigma Chemical Co.
Residue:
519
  
Inhibitor
Name:
BDBM23973
Synonyms:
3-amino-1,2,3,4-tetrahydronaphthalen-2-one hydrochloride | amino-tetralone, 1
Type:
Small organic molecule
Emp. Form.:
C10H11NO
Mol. Mass.:
161.2004
SMILES:
NC1Cc2ccccc2CC1=O
: