Target
cAMP and cAMP-inhibited cGMP 3',5'-cyclic phosphodiesterase 10A
Ligand
BDBM50003981
Substrate
Meas. Tech.
ChEMBL_873145 (CHEMBL2182994)
Ki
<1000±n/a nM
Citation
 Chappie, TAHelal, CJHou, X Current landscape of phosphodiesterase 10A (PDE10A) inhibition. J Med Chem 55:7299-331 (2012)  
Target
Name:
cAMP and cAMP-inhibited cGMP 3',5'-cyclic phosphodiesterase 10A
Synonyms:
3',5'-cyclic phosphodiesterase PDE10_HUMAN Phosphodiesterase 10A
Type:
Protein
Mol. Mass.:
88412.52
Organism:
Homo sapiens (Human)
Description:
Q9Y233
Residue:
779
  
Inhibitor
Name:
BDBM50003981
Synonyms:
CHEMBL2180431
Type:
Small organic molecule
Emp. Form.:
C28H28N4O2
Mol. Mass.:
452.5475
SMILES:
COc1c(C)cc(COc2ccc(cc2)-c2cccnc2N2CCc3ncccc3C2)nc1C
: