Target
cAMP and cAMP-inhibited cGMP 3',5'-cyclic phosphodiesterase 10A
Ligand
BDBM50398005
Substrate
Meas. Tech.
ChEMBL_873145 (CHEMBL2182994)
Ki
15±n/a nM
Citation
 Chappie, TAHelal, CJHou, X Current landscape of phosphodiesterase 10A (PDE10A) inhibition. J Med Chem 55:7299-331 (2012)  
Target
Name:
cAMP and cAMP-inhibited cGMP 3',5'-cyclic phosphodiesterase 10A
Synonyms:
3',5'-cyclic phosphodiesterase PDE10_HUMAN Phosphodiesterase 10A
Type:
Protein
Mol. Mass.:
88412.52
Organism:
Homo sapiens (Human)
Description:
Q9Y233
Residue:
779
  
Inhibitor
Name:
BDBM50398005
Synonyms:
CHEMBL2180430 | US8691827, I-8
Type:
Small organic molecule
Emp. Form.:
C28H31N7O
Mol. Mass.:
481.592
SMILES:
CC(C)CC(=O)N1CCc2nc(nc(N(C)Cc3ccccc3)c2C1)-c1cncc(c1)-c1cn[nH]c1
: