Target
cAMP and cAMP-inhibited cGMP 3',5'-cyclic phosphodiesterase 10A
Ligand
BDBM50398009
Substrate
Meas. Tech.
ChEMBL_873145 (CHEMBL2182994)
Ki
1900±n/a nM
Citation
 Chappie, TAHelal, CJHou, X Current landscape of phosphodiesterase 10A (PDE10A) inhibition. J Med Chem 55:7299-331 (2012)  
Target
Name:
cAMP and cAMP-inhibited cGMP 3',5'-cyclic phosphodiesterase 10A
Synonyms:
3',5'-cyclic phosphodiesterase PDE10_HUMAN Phosphodiesterase 10A
Type:
Protein
Mol. Mass.:
88412.52
Organism:
Homo sapiens (Human)
Description:
Q9Y233
Residue:
779
  
Inhibitor
Name:
BDBM50398009
Synonyms:
CHEMBL2180425
Type:
Small organic molecule
Emp. Form.:
C24H17N3O4
Mol. Mass.:
411.4095
SMILES:
COc1ccc(cc1)-n1c(CN2C(=O)c3ccccc3C2=O)nc2ccccc2c1=O
: