Target
cAMP and cAMP-inhibited cGMP 3',5'-cyclic phosphodiesterase 10A
Ligand
BDBM50398013
Substrate
Meas. Tech.
ChEMBL_873145 (CHEMBL2182994)
Ki
0.900000±n/a nM
Citation
 Chappie, TAHelal, CJHou, X Current landscape of phosphodiesterase 10A (PDE10A) inhibition. J Med Chem 55:7299-331 (2012)  
Target
Name:
cAMP and cAMP-inhibited cGMP 3',5'-cyclic phosphodiesterase 10A
Synonyms:
3',5'-cyclic phosphodiesterase PDE10A Phosphodiesterase 10 (PDE10) | Phosphodiesterase 10A
Type:
Protein
Mol. Mass.:
88412.52
Organism:
Homo sapiens (Human)
Description:
Q9Y233
Residue:
1055
  
Inhibitor
Name:
BDBM50398013
Synonyms:
CHEMBL2180421 | US8492392, K-2
Type:
Small organic molecule
Emp. Form.:
C20H22ClN7O2
Mol. Mass.:
427.887
SMILES:
CC(C)Oc1nc(nc2CCN(Cc12)C(=O)Nc1cnn(C)c1)-c1ccc(Cl)nc1
: