Target
DNA-dependent protein kinase catalytic subunit
Ligand
BDBM50341751
Substrate
Meas. Tech.
ChEMBL_873192 (CHEMBL2183423)
Ki
6±n/a nM
Citation
 Finlay, MRGriffin, RJ Modulation of DNA repair by pharmacological inhibitors of the PIKK protein kinase family. Bioorg Med Chem Lett 22:5352-9 (2012)  
Target
Name:
DNA-dependent protein kinase catalytic subunit
Synonyms:
DNA-PK catalytic subunit DNA-dependent protein kinase (DNA-PK) DNA-dependent protein kinase catalytic subunit (DNA-PK) HYRC PRKDC | PRKDC_HUMAN
Type:
Protein
Mol. Mass.:
469114.78
Organism:
Homo sapiens (Human)
Description:
P78527
Residue:
4128
  
Inhibitor
Name:
BDBM50341751
Synonyms:
3-amino-6-(4-((1-(dimethylamino)propan-2-yl)sulfonyl)-phenyl)-N-phenylpyrazine-2-carboxamide | CHEMBL1766797
Type:
Small organic molecule
Emp. Form.:
C22H25N5O3S
Mol. Mass.:
439.531
SMILES:
CC(CN(C)C)S(=O)(=O)c1ccc(cc1)-c1cnc(N)c(n1)C(=O)Nc1ccccc1
: