Target
Prothrombin
Ligand
BDBM50398079
Substrate
Meas. Tech.
ChEMBL_873896 (CHEMBL2184307)
IC50
92000±n/a nM
Citation
 Madsen, JLAndersen, TLSantamaria, SNagase, HEnghild, JJSkrydstrup, T Synthesis and evaluation of silanediols as highly selective uncompetitive inhibitors of human neutrophil elastase. J Med Chem 55:7900-8 (2012)  
Target
Name:
Prothrombin
Synonyms:
Activation peptide fragment 1 Coagulation factor II Prothrombin precursor Thrombin heavy chain | Thrombin light chain
Type:
Protein
Mol. Mass.:
70029.57
Organism:
Homo sapiens (Human)
Description:
P00734
Residue:
622
  
Inhibitor
Name:
BDBM50398079
Synonyms:
CHEMBL2182018
Type:
Small organic molecule
Emp. Form.:
C42H55N3O3Si
Mol. Mass.:
677.9899
SMILES:
CCCCNC(=O)CC[Si]([C@H](CC(C)C)NC(=O)[C@@H](NC(=O)Cc1ccc2ccccc2c1)[C@@H](C)CC)(c1ccccc1)c1ccccc1
: