Target
Cannabinoid receptor 2
Ligand
BDBM50398219
Substrate
Meas. Tech.
ChEMBL_874192 (CHEMBL2187924)
Ki
10000±n/a nM
Citation
 Rempel, VVolz, NHinz, SKarcz, TMeliciani, INieger, MWenzel, WBräse, SMüller, CE 7-Alkyl-3-benzylcoumarins: a versatile scaffold for the development of potent and selective cannabinoid receptor agonists and antagonists. J Med Chem 55:7967-77 (2012)  
Target
Name:
Cannabinoid receptor 2
Synonyms:
CANNABINOID CB2 CB2 CB2B CNR2_HUMAN Cannabinoid CB2 receptor Cannabinoid receptor 2 (CB2R) | hCB2
Type:
G Protein-Coupled Receptor (GPCR)
Mol. Mass.:
39690.94
Organism:
Homo sapiens (Human)
Description:
P34972
Residue:
360
  
Inhibitor
Name:
BDBM50398219
Synonyms:
CHEMBL2181541
Type:
Small organic molecule
Emp. Form.:
C28H36O4
Mol. Mass.:
436.583
SMILES:
CCCCCCCC(C)(C)c1cc(OC)c2cc(Cc3ccccc3OC)c(=O)oc2c1
: