Target
Serine/threonine-protein kinase pim-1
Ligand
BDBM26626
Substrate
Meas. Tech.
ChEMBL_874457 (CHEMBL2184780)
Ki
24±n/a nM
Citation
 Drygin, DHaddach, MPierre, FRyckman, DM Potential use of selective and nonselective Pim kinase inhibitors for cancer therapy. J Med Chem 55:8199-208 (2012)  
Target
Name:
Serine/threonine-protein kinase pim-1
Synonyms:
PIM-1 Kinase PIM1_HUMAN Serine/threonine-protein kinase (PIM1) Serine/threonine-protein kinase PIM1 | Serine/threonine-protein kinase pim-1 (PIM1)
Type:
Protein
Mol. Mass.:
35681.82
Organism:
Homo sapiens (Human)
Description:
P11309
Residue:
313
  
Inhibitor
Name:
BDBM26626
Synonyms:
(5Z)-5-{[3-(trifluoromethyl)phenyl]methylidene}-1,3-thiazolidine-2,4-dione thiazolidine-2,4-dione, 4a
Type:
Small organic molecule
Emp. Form.:
C11H6F3NO2S
Mol. Mass.:
273.231
SMILES:
OC1=NC(=O)C(S1)=Cc1cccc(c1)C(F)(F)F
: