Target
Beta-secretase 1
Ligand
BDBM50398268
Substrate
Meas. Tech.
ChEMBL_874894 (CHEMBL2183079)
IC50
2.6±n/a nM
Citation
 Swahn, BMKolmodin, KKarlström, Svon Berg, SSöderman, PHolenz, JBerg, SLindström, JSundström, MTurek, DKihlström, JSlivo, CAndersson, LPyring, DRotticci, DOhberg, LKers, ABogar, Kvon Kieseritzky, FBergh, MOlsson, LLJanson, JEketjäll, SGeorgievska, BJeppsson, FFälting, J Design and synthesis ofß-site amyloid precursor protein cleaving enzyme (BACE1) inhibitors with in vivo brain reduction ofß-amyloid peptides. J Med Chem 55:9346-61 (2012)  
Target
Name:
Beta-secretase 1
Synonyms:
ASP2 Aspartyl protease 2 BACE1 Beta-secretase (BACE) Beta-secretase 1 (BACE 1) Beta-secretase 1 (BACE1) Beta-site amyloid precursor protein cleaving enzyme 1 Memapsin-2 beta-Secretase (BACE-1) | beta-Secretase (BACE1)
Type:
Protein
Mol. Mass.:
55755.10
Organism:
Homo sapiens (Human)
Description:
P56817
Residue:
501
  
Inhibitor
Name:
BDBM50398268
Synonyms:
CHEMBL2177303
Type:
Small organic molecule
Emp. Form.:
C30H24F2N4O
Mol. Mass.:
494.5346
SMILES:
CCn1cc(cc(C)c1=O)[C@@]1(N=C(N)c2c1cc(F)cc2F)c1cccc(c1)-c1cncc(c1)C#CC
: