Target
Beta-secretase 2
Ligand
BDBM50398261
Substrate
Meas. Tech.
ChEMBL_874882 (CHEMBL2182698)
Ki
740±n/a nM
Citation
 Swahn, BMKolmodin, KKarlström, Svon Berg, SSöderman, PHolenz, JBerg, SLindström, JSundström, MTurek, DKihlström, JSlivo, CAndersson, LPyring, DRotticci, DOhberg, LKers, ABogar, Kvon Kieseritzky, FBergh, MOlsson, LLJanson, JEketjäll, SGeorgievska, BJeppsson, FFälting, J Design and synthesis ofß-site amyloid precursor protein cleaving enzyme (BACE1) inhibitors with in vivo brain reduction ofß-amyloid peptides. J Med Chem 55:9346-61 (2012)  
Target
Name:
Beta-secretase 2
Synonyms:
AEPLC ASP1 Asp 1 Aspartyl protease 1 BACE2_HUMAN Beta-secretase (BACE) Beta-secretase 2 (BACE-2) Beta-site APP-cleaving enzyme 2 Memapsin-1 beta-Secretase (BACE-2)
Type:
Protein
Mol. Mass.:
56171.20
Organism:
Homo sapiens (Human)
Description:
Q9Y5Z0
Residue:
518
  
Inhibitor
Name:
BDBM50398261
Synonyms:
CHEMBL2177919
Type:
Small organic molecule
Emp. Form.:
C25H20FN5O
Mol. Mass.:
425.4576
SMILES:
Cc1cc(cn(C)c1=O)C1(N=C(N)c2c1cccc2F)c1cccc(c1)-c1cncnc1
: