Target
Beta-secretase 1
Ligand
BDBM50398309
Substrate
Meas. Tech.
ChEMBL_874923 (CHEMBL2183108)
IC50
39±n/a nM
Citation
 Huang, HLa, DSCheng, ACWhittington, DAPatel, VFChen, KDineen, TAEpstein, OGraceffa, RHickman, DKiang, YHLouie, SLuo, YWahl, RCWen, PHWood, SFremeau, RT Structure- and property-based design of aminooxazoline xanthenes as selective, orally efficacious, and CNS penetrable BACE inhibitors for the treatment of Alzheimer's disease. J Med Chem 55:9156-69 (2012)  
Target
Name:
Beta-secretase 1
Synonyms:
ASP2 Aspartyl protease 2 BACE1 Beta-secretase (BACE) Beta-secretase 1 (BACE 1) Beta-secretase 1 (BACE1) Beta-site amyloid precursor protein cleaving enzyme 1 Memapsin-2 beta-Secretase (BACE-1) | beta-Secretase (BACE1)
Type:
Protein
Mol. Mass.:
55755.10
Organism:
Homo sapiens (Human)
Description:
P56817
Residue:
501
  
Inhibitor
Name:
BDBM50398309
Synonyms:
CHEMBL2177317
Type:
Small organic molecule
Emp. Form.:
C25H33N3O3
Mol. Mass.:
423.5478
SMILES:
CCc1cnc2OC3(CCC3)C[C@H](NC[C@@H](O)[C@H](Cc3ccccc3)NC(C)=O)c2c1
: