Target
Type-1 angiotensin II receptor
Ligand
BDBM50042235
Substrate
Meas. Tech.
ChEMBL_875613 (CHEMBL2184411)
Ki
0.8±n/a nM
Citation
 Pease, JHoruk, R Chemokine receptor antagonists. J Med Chem 55:9363-92 (2012)  
Target
Name:
Type-1 angiotensin II receptor
Synonyms:
AGTR1 AGTR1B AT1 AT1BR AT2R1B Angiotensin II receptor Type-1 angiotensin II receptor (AT1)
Type:
Protein
Mol. Mass.:
41080.75
Organism:
Homo sapiens (Human)
Description:
P30556
Residue:
359
  
Inhibitor
Name:
BDBM50042235
Synonyms:
2-butyl-3-{[2'-(1H-tetrazol-5-yl)[1,1'-biphenyl]-4-yl]methyl}-1,3-diazaspiro[4.4]non-1-en-4-one BMS 186295 IRBESARTAN
Type:
Small organic molecule
Emp. Form.:
C25H28N6O
Mol. Mass.:
428.5294
SMILES:
CCCCC1=NC2(CCCC2)C(=O)N1Cc1ccc(cc1)-c1ccccc1-c1nnn[nH]1
: