Target
RAC-gamma serine/threonine-protein kinase
Ligand
BDBM50398363
Substrate
Meas. Tech.
ChEMBL_875914 (CHEMBL2188027)
IC50
26±n/a nM
Citation
 Blake, JFXu, RBencsik, JRXiao, DKallan, NCSchlachter, SMitchell, ISSpencer, KLBanka, ALWallace, EMGloor, SLMartinson, MWoessner, RDVigers, GPBrandhuber, BJLiang, JSafina, BSLi, JZhang, BChabot, CDo, SLee, LOeh, JSampath, DLee, BBLin, KLiederer, BMSkelton, NJ Discovery and preclinical pharmacology of a selective ATP-competitive Akt inhibitor (GDC-0068) for the treatment of human tumors. J Med Chem 55:8110-27 (2012)  
Target
Name:
RAC-gamma serine/threonine-protein kinase
Synonyms:
AKT3 PKB gamma Protein kinase Akt-3 Protein kinase B, gamma RAC-gamma serine/threonine-protein kinase Serine/threonine-protein kinase AKT | Serine/threonine-protein kinase AKT3
Type:
Enzyme
Mol. Mass.:
55769.36
Organism:
Homo sapiens (Human)
Description:
Residue:
479
  
Inhibitor
Name:
BDBM50398363
Synonyms:
CHEMBL2177370
Type:
Small organic molecule
Emp. Form.:
C24H30ClN5O3
Mol. Mass.:
471.98
SMILES:
C[C@@H]1C[C@@H](O)c2ncnc(N3CCN(CC3)C(=O)[C@H]([C@@H]3COCCN3)c3ccc(Cl)cc3)c12
: