Target
RAC-gamma serine/threonine-protein kinase
Ligand
BDBM50398355
Substrate
Meas. Tech.
ChEMBL_875914 (CHEMBL2188027)
IC50
5±n/a nM
Citation
 Blake, JFXu, RBencsik, JRXiao, DKallan, NCSchlachter, SMitchell, ISSpencer, KLBanka, ALWallace, EMGloor, SLMartinson, MWoessner, RDVigers, GPBrandhuber, BJLiang, JSafina, BSLi, JZhang, BChabot, CDo, SLee, LOeh, JSampath, DLee, BBLin, KLiederer, BMSkelton, NJ Discovery and preclinical pharmacology of a selective ATP-competitive Akt inhibitor (GDC-0068) for the treatment of human tumors. J Med Chem 55:8110-27 (2012)  
Target
Name:
RAC-gamma serine/threonine-protein kinase
Synonyms:
AKT3 PKB gamma Protein kinase Akt-3 Protein kinase B, gamma RAC-gamma serine/threonine-protein kinase Serine/threonine-protein kinase AKT | Serine/threonine-protein kinase AKT3
Type:
Enzyme
Mol. Mass.:
55769.36
Organism:
Homo sapiens (Human)
Description:
Residue:
479
  
Inhibitor
Name:
BDBM50398355
Synonyms:
CHEMBL2177374
Type:
Small organic molecule
Emp. Form.:
C25H32ClN5O2
Mol. Mass.:
470.007
SMILES:
C[C@@H]1C[C@@H](O)c2ncnc(N3CCN(CC3)C(=O)[C@H](CNCC3CC3)c3ccc(Cl)cc3)c12
: