Target
RAC-beta serine/threonine-protein kinase
Ligand
BDBM50398381
Substrate
Meas. Tech.
ChEMBL_875912 (CHEMBL2188025)
IC50
6±n/a nM
Citation
 Blake, JFXu, RBencsik, JRXiao, DKallan, NCSchlachter, SMitchell, ISSpencer, KLBanka, ALWallace, EMGloor, SLMartinson, MWoessner, RDVigers, GPBrandhuber, BJLiang, JSafina, BSLi, JZhang, BChabot, CDo, SLee, LOeh, JSampath, DLee, BBLin, KLiederer, BMSkelton, NJ Discovery and preclinical pharmacology of a selective ATP-competitive Akt inhibitor (GDC-0068) for the treatment of human tumors. J Med Chem 55:8110-27 (2012)  
Target
Name:
RAC-beta serine/threonine-protein kinase
Synonyms:
AKT2 PKB beta Protein kinase B (Akt 2) Protein kinase B, beta RAC-alpha serine/threonine-protein kinase (AKT2) RAC-beta serine/threonine-protein kinase (AKT2) Serine/threonine-protein kinase AKT2 | Serine/threonine-protein kinase Rac alpha/beta
Type:
Enzyme
Mol. Mass.:
55766.64
Organism:
Homo sapiens (Human)
Description:
Residue:
481
  
Inhibitor
Name:
BDBM50398381
Synonyms:
CHEMBL2177388
Type:
Small organic molecule
Emp. Form.:
C24H31ClFN5O
Mol. Mass.:
459.987
SMILES:
CC(C)NC[C@@H](C(=O)N1CCN(CC1)c1ncnc2CC[C@@H](CF)c12)c1ccc(Cl)cc1
: