Target
5-hydroxytryptamine receptor 4
Ligand
BDBM50398599
Substrate
Meas. Tech.
ChEMBL_873996 (CHEMBL2185685)
Ki
0.50±n/a nM
Citation
 Brodney, MAJohnson, DESawant-Basak, ACoffman, KJDrummond, EMHudson, ELFisher, KENoguchi, HWaizumi, NMcDowell, LLPapanikolaou, APettersen, BASchmidt, AWTseng, EStutzman-Engwall, KRubitski, DMVanase-Frawley, MAGrimwood, S Identification of multiple 5-HT4 partial agonist clinical candidates for the treatment of Alzheimer's disease. J Med Chem 55:9240-54 (2012)  
Target
Name:
5-hydroxytryptamine receptor 4
Synonyms:
5-HT-4 5-HT4S 5-HT4b 5-HT4d 5-hydroxytryptamine receptor 4 5HT4R_HUMAN Serotonin (5-HT) receptor Serotonin 4 (5-HT4) receptor | Serotonin Receptor 4
Type:
Enzyme
Mol. Mass.:
43767.54
Organism:
Homo sapiens (Human)
Description:
Q13639
Residue:
388
  
Inhibitor
Name:
BDBM50398599
Synonyms:
CHEMBL2179580
Type:
Small organic molecule
Emp. Form.:
C24H34N2O6
Mol. Mass.:
446.5366
SMILES:
O[C@@H]1CC[C@H](C1)Oc1cccc2onc(OCC3CCN(CC4(O)CCOCC4)CC3)c12
: