Target
Leucine-rich repeat serine/threonine-protein kinase 2
Ligand
BDBM50398662
Substrate
Meas. Tech.
ChEMBL_874769 (CHEMBL2188383)
Ki
1±n/a nM
Citation
 Estrada, AALiu, XBaker-Glenn, CBeresford, ABurdick, DJChambers, MChan, BKChen, HDing, XDiPasquale, AGDominguez, SLDotson, JDrummond, JFlagella, MFlynn, SFuji, RGill, AGunzner-Toste, JHarris, SFHeffron, TPKleinheinz, TLee, DWLe Pichon, CELyssikatos, JPMedhurst, ADMoffat, JGMukund, SNash, KScearce-Levie, KSheng, ZShore, DGTran, TTrivedi, NWang, SZhang, SZhang, XZhao, GZhu, HSweeney, ZK Discovery of highly potent, selective, and brain-penetrable leucine-rich repeat kinase 2 (LRRK2) small molecule inhibitors. J Med Chem 55:9416-33 (2012)  
Target
Name:
Leucine-rich repeat serine/threonine-protein kinase 2
Synonyms:
Dardarin LRRK2_HUMAN Leucine-rich repeat serine/threonine-protein kinase 2 PARK8
Type:
Protein
Mol. Mass.:
286113.20
Organism:
Homo sapiens (Human)
Description:
Q5S007
Residue:
2527
  
Inhibitor
Name:
BDBM50398662
Synonyms:
CHEMBL2178140
Type:
Small organic molecule
Emp. Form.:
C19H23F4N5O3
Mol. Mass.:
445.4112
SMILES:
CCNc1nc(Nc2cc(F)c(cc2OC)C(=O)NCC(C)(C)O)ncc1C(F)(F)F
: