Target
Beta-secretase 1
Ligand
BDBM50398689
Substrate
Meas. Tech.
ChEMBL_874985 (CHEMBL2183861)
Ki
6±n/a nM
Citation
 Mandal, MZhu, ZCumming, JNLiu, XStrickland, CMazzola, RDCaldwell, JPLeach, PGrzelak, MHyde, LZhang, QTerracina, GZhang, LChen, XKuvelkar, RKennedy, MEFavreau, LCox, KOrth, PBuevich, AVoigt, JWang, HKazakevich, IMcKittrick, BAGreenlee, WParker, EMStamford, AW Design and validation of bicyclic iminopyrimidinones as beta amyloid cleaving enzyme-1 (BACE1) inhibitors: conformational constraint to favor a bioactive conformation. J Med Chem 55:9331-45 (2012)  
Target
Name:
Beta-secretase 1
Synonyms:
ASP2 Aspartyl protease 2 BACE1 Beta-secretase (BACE) Beta-secretase 1 (BACE 1) Beta-secretase 1 (BACE1) Beta-site amyloid precursor protein cleaving enzyme 1 Memapsin-2 beta-Secretase (BACE-1) | beta-Secretase (BACE1)
Type:
Protein
Mol. Mass.:
55755.10
Organism:
Homo sapiens (Human)
Description:
P56817
Residue:
501
  
Inhibitor
Name:
BDBM50398689
Synonyms:
CHEMBL2178713
Type:
Small organic molecule
Emp. Form.:
C24H19N7OS
Mol. Mass.:
453.519
SMILES:
CN1C(N)=N[C@]2(CN(C[C@H]2C1=O)c1ncccc1C#N)c1cc(cs1)-c1cccc(c1)C#N
: