Target
Uridine 5'-monophosphate synthase
Ligand
BDBM50310540
Substrate
Meas. Tech.
ChEMBL_874989 (CHEMBL2183865)
Ki
1400000±n/a nM
Citation
 Purohit, MKPoduch, EWei, LWCrandall, IETo, TKain, KCPai, EFKotra, LP Novel cytidine-based orotidine-5'-monophosphate decarboxylase inhibitors with an unusual twist. J Med Chem 55:9988-97 (2012)  
Target
Name:
Uridine 5'-monophosphate synthase
Synonyms:
Orotate phosphoribosyltransferase (HsOPRT) UMPS | UMPS_HUMAN
Type:
Enzyme
Mol. Mass.:
52224.99
Organism:
Homo sapiens (Human)
Description:
P11172
Residue:
480
  
Inhibitor
Name:
BDBM50310540
Synonyms:
((2R,3S,4R,5R)-5-(4-amino-2-oxopyrimidin-1(2H)-yl)-3,4-dihydroxy-tetrahydrofuran-2-yl)methyl dihydrogen phosphate CHEMBL307679 Phosphoric acid mono-[5-(4-amino-2-oxo-2H-pyrimidin-1-yl)-3,4-dihydroxy-tetrahydro-furan-2-ylmethyl] ester | cytidine 5'-phosphate
Type:
Small organic molecule
Emp. Form.:
C9H14N3O8P
Mol. Mass.:
323.1965
SMILES:
Nc1ccn([C@@H]2O[C@H](COP(O)(O)=O)[C@@H](O)[C@H]2O)c(=O)n1
: