Target
5-hydroxytryptamine receptor 4
Ligand
BDBM50398983
Substrate
Meas. Tech.
ChEMBL_875039 (CHEMBL2184357)
Ki
0.1±n/a nM
Citation
 Furlotti, GAlisi, MAApicella, CCapezzone de Joannon, ACazzolla, NCosti, RCuzzucoli Crucitti, GGarrone, BIacovo, AMagarò, GMangano, GMiele, GOmbrato, RPescatori, LPolenzani, LRosi, FVitiello, MDi Santo, R Discovery and pharmacological profile of new 1H-indazole-3-carboxamide and 2H-pyrrolo[3,4-c]quinoline derivatives as selective serotonin 4 receptor ligands. J Med Chem 55:9446-66 (2012)  
Target
Name:
5-hydroxytryptamine receptor 4
Synonyms:
5-HT-4 5-HT4S 5-HT4b 5-HT4d 5-hydroxytryptamine receptor 4 5HT4R_HUMAN Serotonin (5-HT) receptor Serotonin 4 (5-HT4) receptor | Serotonin Receptor 4
Type:
Enzyme
Mol. Mass.:
43767.54
Organism:
Homo sapiens (Human)
Description:
Q13639
Residue:
388
  
Inhibitor
Name:
BDBM50398983
Synonyms:
CHEMBL2179697
Type:
Small organic molecule
Emp. Form.:
C24H31N5O
Mol. Mass.:
405.5358
SMILES:
CC(C)n1nc(C(=O)NCC2CCN(CCc3ccccn3)CC2)c2ccccc12
: