Target
Carbonic anhydrase 9
Ligand
BDBM50399075
Substrate
Meas. Tech.
ChEMBL_878780 (CHEMBL2183720)
Ki
3250±n/a nM
Citation
 Marini, AMMaresca, AAggarwal, MOrlandini, ENencetti, SDa Settimo, FSalerno, SSimorini, FLa Motta, CTaliani, SNuti, EScozzafava, AMcKenna, RRossello, ASupuran, CT Tricyclic sulfonamides incorporating benzothiopyrano[4,3-c]pyrazole and pyridothiopyrano[4,3-c]pyrazole effectively inhibita- andß-carbonic anhydrase: X-ray crystallography and solution investigations on 15 isoforms. J Med Chem 55:9619-29 (2012)  
Target
Name:
Carbonic anhydrase 9
Synonyms:
CA-IX CAH9_HUMAN Carbonic anhydrase 9 (CA IX) Carbonic anhydrase 9 precursor Carbonic anhydrase IX (CAIX) Carbonic anhydrases; II & IX MN RCC-associated antigen G250
Type:
Enzyme
Mol. Mass.:
49669.03
Organism:
Homo sapiens (Human)
Description:
Catalytic domain of human cloned isozyme was used in the assay
Residue:
459
  
Inhibitor
Name:
BDBM50399075
Synonyms:
CHEMBL2179304
Type:
Small organic molecule
Emp. Form.:
C16H14N4O2S2
Mol. Mass.:
358.438
SMILES:
Cc1ccc2-c3c(CSc2n1)cnn3-c1ccc(cc1)S(N)(=O)=O
: