Target
Carbonic anhydrase 7
Ligand
BDBM50399075
Substrate
Meas. Tech.
ChEMBL_878782 (CHEMBL2183722)
Ki
912±n/a nM
Citation
 Marini, AMMaresca, AAggarwal, MOrlandini, ENencetti, SDa Settimo, FSalerno, SSimorini, FLa Motta, CTaliani, SNuti, EScozzafava, AMcKenna, RRossello, ASupuran, CT Tricyclic sulfonamides incorporating benzothiopyrano[4,3-c]pyrazole and pyridothiopyrano[4,3-c]pyrazole effectively inhibita- andß-carbonic anhydrase: X-ray crystallography and solution investigations on 15 isoforms. J Med Chem 55:9619-29 (2012)  
Target
Name:
Carbonic anhydrase 7
Synonyms:
CA-VII CAH7_HUMAN Carbonic anhydrase Carbonic anhydrase VII (CA VII)
Type:
Enzyme
Mol. Mass.:
29664.11
Organism:
Homo sapiens (Human)
Description:
Human cloned isozyme.
Residue:
264
  
Inhibitor
Name:
BDBM50399075
Synonyms:
CHEMBL2179304
Type:
Small organic molecule
Emp. Form.:
C16H14N4O2S2
Mol. Mass.:
358.438
SMILES:
Cc1ccc2-c3c(CSc2n1)cnn3-c1ccc(cc1)S(N)(=O)=O
: