Target
Thymidylate synthase
Ligand
BDBM50022238
Substrate
Meas. Tech.
ChEMBL_877089 (CHEMBL2186825)
Ki
14±n/a nM
Citation
 Carosati, ETochowicz, AMarverti, GGuaitoli, GBenedetti, PFerrari, SStroud, RMFiner-Moore, JLuciani, RFarina, DCruciani, GCosti, MP Inhibitor of ovarian cancer cells growth by virtual screening: a new thiazole derivative targeting human thymidylate synthase. J Med Chem 55:10272-6 (2012)  
Target
Name:
Thymidylate synthase
Synonyms:
TS TYMS Thymidylate synthase (TS) | Thymidylate synthase/GAR transformylase/AICAR transformylase
Type:
Enzyme
Mol. Mass.:
35718.07
Organism:
Homo sapiens (Human)
Description:
Residue:
313
  
Inhibitor
Name:
BDBM50022238
Synonyms:
(R)-5-Fluoro-1-((4S,5R)-4-hydroxy-5-methylphosphate-tetrahydro-furan-2-yl)-1H-pyrimidine-2,4-dione 5-Fluoro-2-Deoxyuridine Monophosphate (Fdump) Phosphoric acid mono-[(2R,3S,5R)-5-(5-fluoro-2,4-dioxo-3,4-dihydro-2H-pyrimidin-1-yl)-3-hydroxy-tetrahydro-furan-2-ylmethyl] ester | Phosphoric acid mono-[5-(5-fluoro-2,4-dioxo-3,4-dihydro-2H-pyrimidin-1-yl)-3-hydroxy-tetrahydro-furan-2-ylmethyl] ester
Type:
Small organic molecule
Emp. Form.:
C9H12FN2O8P
Mol. Mass.:
326.1723
SMILES:
O[C@H]1C[C@@H](O[C@@H]1COP(O)(O)=O)n1cc(F)c(=O)[nH]c1=O
: