Target
Albumin
Ligand
BDBM50399329
Substrate
Meas. Tech.
ChEMBL_877317 (CHEMBL2188999)
Kd
24±n/a nM
Citation
 Angelini, AMorales-Sanfrutos, JDiderich, PChen, SHeinis, C Bicyclization and tethering to albumin yields long-acting peptide antagonists. J Med Chem 55:10187-97 (2012)  
Target
Name:
Albumin
Synonyms:
ALBU_MOUSE Alb-1 Serum albumin
Type:
PROTEIN
Mol. Mass.:
68686.28
Organism:
Mus musculus
Description:
ChEMBL_877317
Residue:
608
  
Inhibitor
Name:
BDBM50399329
Synonyms:
CHEMBL2180871
Type:
Small organic molecule
Emp. Form.:
C109H167N31O30S2
Mol. Mass.:
2455.812
SMILES:
CC[C@H](C)[C@H](NC(=O)[C@H](CC(C)C)NC(=O)[C@H](CCCN=C(N)N)N[C@@H](CCCCN)C(=O)NCCCCN=[N+]=[N-])C(=O)N[C@@H](CCC(O)=O)C(=O)N[C@@H](CC(O)=O)C(=O)N[C@@H]([C@@H](C)CC)C(=O)N[C@H]1CSSC[C@H](NC(=O)CNC(=O)[C@H](Cc2c[nH]c3ccccc23)NC(=O)[C@H](CCCN=C(N)N)NC(=O)[C@@H]2CCCN2C(=O)[C@H](CC(C)C)NC1=O)C(=O)N[C@@H](CC(C)C)C(=O)N[C@@H](Cc1c[nH]c2ccccc12)C(=O)N[C@@H](CCC(O)=O)C(=O)N[C@@H](CC(O)=O)C(=O)N[C@@H](CC(O)=O)C(O)=O
: