Target
Toll-like receptor 2
Ligand
BDBM50399450
Substrate
Meas. Tech.
ChEMBL_878175 (CHEMBL2184096)
Ki
91±n/a nM
Citation
 Huynh, ASChung, WJCho, HIMoberg, VECelis, EMorse, DLVagner, J Novel toll-like receptor 2 ligands for targeted pancreatic cancer imaging and immunotherapy. J Med Chem 55:9751-62 (2012)  
Target
Name:
Toll-like receptor 2
Synonyms:
TIL4 TLR2_HUMAN Toll-like receptor 2 (TLR2)
Type:
Protein
Mol. Mass.:
89837.58
Organism:
Homo sapiens (Human)
Description:
O60603
Residue:
784
  
Inhibitor
Name:
BDBM50399450
Synonyms:
CHEMBL2179403
Type:
Small organic molecule
Emp. Form.:
C73H136N8O21S
Mol. Mass.:
1493.967
SMILES:
CCCCCCCCCCCCCCCC(=O)OC[C@H](CSC[C@H](NC(=O)COCC(=O)NCCCOCCOCCOCCCNC(C)=O)C(=O)NCC(=O)N[C@H](CO)C(=O)NCCCOCCOCCOCCCNC(=O)COCC(N)=O)OC(=O)CCCCCCCCCCCCCCC
: