Target
Toll-like receptor 2
Ligand
BDBM50399454
Substrate
Meas. Tech.
ChEMBL_878176 (CHEMBL2184097)
Ki
11±n/a nM
Citation
 Huynh, ASChung, WJCho, HIMoberg, VECelis, EMorse, DLVagner, J Novel toll-like receptor 2 ligands for targeted pancreatic cancer imaging and immunotherapy. J Med Chem 55:9751-62 (2012)  
Target
Name:
Toll-like receptor 2
Synonyms:
TIL4 TLR2_HUMAN Toll-like receptor 2 (TLR2)
Type:
Protein
Mol. Mass.:
89837.58
Organism:
Homo sapiens (Human)
Description:
O60603
Residue:
784
  
Inhibitor
Name:
BDBM50399454
Synonyms:
CHEMBL2179401
Type:
Small organic molecule
Emp. Form.:
C109H175N12O30S4
Mol. Mass.:
2261.879
SMILES:
CCCCCCCCCCCCCCCC(=O)OCC(CSCC(NC(=O)COCC(=O)NCCCOCCOCCOCCCNC(=O)CCSC1CC(=O)N(CCNC(=O)CCCCC[N+]2=C(Cc3cc(ccc23)S([O-])(=O)=O)\C=C\C=C\C=C2\Cc3cc(ccc3N2CC)S([O-])(=O)=O)C1=O)C(=O)NCC(=O)NC(CO)C(=O)NCCCOCCOCCOCCCNC(=O)COCC(N)=O)OC(=O)CCCCCCCCCCCCCCC
: