Target
Vascular endothelial growth factor receptor 2
Ligand
BDBM50399540
Substrate
Meas. Tech.
ChEMBL_878372 (CHEMBL2186465)
IC50
16±n/a nM
Citation
 Musumeci, FRadi, MBrullo, CSchenone, S Vascular endothelial growth factor (VEGF) receptors: drugs and new inhibitors. J Med Chem 55:10797-822 (2012)  
Target
Name:
Vascular endothelial growth factor receptor 2
Synonyms:
CD_antigen=CD309 Fetal liver kinase 1 (FLK-1) KDR Protein-tyrosine kinase receptor Flk-1 VEGFR-2 VEGFR2 Vascular Endothelial Growth Factor Receptor Kinase 2 Vascular endothelial growth factor receptor 2 (KDR) Vascular endothelial growth factor receptor 2 (VEGFR2) Vascular endothelial growth factor receptor-2 (VEGFR-2)
Type:
Receptor Tyrosine Kinase
Mol. Mass.:
151510.97
Organism:
Homo sapiens (Human)
Description:
P35968
Residue:
1356
  
Inhibitor
Name:
BDBM50399540
Synonyms:
FORETINIB US10882853, Compound For-Oxide
Type:
Small organic molecule
Emp. Form.:
C34H34F2N4O6
Mol. Mass.:
632.6538
SMILES:
COc1cc2c(Oc3ccc(NC(=O)C4(CC4)C(=O)Nc4ccc(F)cc4)cc3F)ccnc2cc1OCCCN1CCOCC1
: