Target
Voltage-dependent N-type calcium channel subunit alpha-1B
Ligand
BDBM50399545
Substrate
Meas. Tech.
ChEMBL_878508 (CHEMBL2187793)
IC50
660±n/a nM
Citation
 Shao, PPYe, FChakravarty, PKVarughese, DJHerrington, JBDai, GBugianesi, RMHaedo, RJSwensen, AMWarren, VASmith, MMGarcia, MLMcManus, OBLyons, KALi, XGreen, MJochnowitz, NMcGowan, EMistry, SSun, SYAbbadie, CKaczorowski, GJDuffy, JL Aminopiperidine sulfonamide Cav2.2 channel inhibitors for the treatment of chronic pain. J Med Chem 55:9847-55 (2012)  
Target
Name:
Voltage-dependent N-type calcium channel subunit alpha-1B
Synonyms:
BIII CAC1B_HUMAN CACNA1B Calcium channel (Type N) Voltage-dependent N-type calcium channel subunit alpha-1B Voltage-gated N-type calcium channel alpha-1B subunit Voltage-gated calcium channel Voltage-gated calcium channel subunit alpha Cav2.2 ((alpha 1B, beta 1b, alpha 2 delta-1) | calcium channel, voltage-dependent, N type, alpha 1B subunit
Type:
Enzyme
Mol. Mass.:
262548.16
Organism:
Homo sapiens (Human)
Description:
Q00975
Residue:
2339
  
Inhibitor
Name:
BDBM50399545
Synonyms:
CHEMBL2180902
Type:
Small organic molecule
Emp. Form.:
C23H25F3N2O5S2
Mol. Mass.:
530.58
SMILES:
CS(=O)(=O)c1ccccc1C(=O)N1CCC(CC1)N(C1CC1)S(=O)(=O)c1cccc(c1)C(F)(F)F
: