Target
5-hydroxytryptamine receptor 5A
Ligand
BDBM50399619
Substrate
Meas. Tech.
ChEMBL_878520 (CHEMBL2188185)
Ki
>10000±n/a nM
Citation
 Dubost, EDumas, NFossey, CMagnelli, RButt-Gueulle, SBallandonne, CCaignard, DHDulin, FSopkova de-Oliveira Santos, JMillet, PCharnay, YRault, SCailly, TFabis, F Synthesis and structure-affinity relationships of selective high-affinity 5-HT(4) receptor antagonists: application to the design of new potential single photon emission computed tomography tracers. J Med Chem 55:9693-707 (2012)  
Target
Name:
5-hydroxytryptamine receptor 5A
Synonyms:
5-HT-5 5-hydroxytryptamine receptor 5 (5-HT5) 5HT5A_HUMAN Serotonin (5-HT) receptor | Serotonin receptor 5A
Type:
Enzyme
Mol. Mass.:
40266.25
Organism:
Homo sapiens (Human)
Description:
P47898
Residue:
357
  
Inhibitor
Name:
BDBM50399619
Synonyms:
CHEMBL2181189
Type:
Small organic molecule
Emp. Form.:
C22H25FN2O
Mol. Mass.:
352.4451
SMILES:
CCCN1CCC(COc2nc3c(F)cccc3c3ccccc23)CC1
: