Target
5-hydroxytryptamine receptor 2A
Ligand
BDBM50399616
Substrate
Meas. Tech.
ChEMBL_878526 (CHEMBL2188191)
Ki
1780±n/a nM
Citation
 Dubost, EDumas, NFossey, CMagnelli, RButt-Gueulle, SBallandonne, CCaignard, DHDulin, FSopkova de-Oliveira Santos, JMillet, PCharnay, YRault, SCailly, TFabis, F Synthesis and structure-affinity relationships of selective high-affinity 5-HT(4) receptor antagonists: application to the design of new potential single photon emission computed tomography tracers. J Med Chem 55:9693-707 (2012)  
Target
Name:
5-hydroxytryptamine receptor 2A
Synonyms:
5-HT-2 5-HT2A 5-hydroxytryptamine receptor 2A (5HT-2A) 5HT2A_HUMAN HTR2A | Serotonin receptor 2A
Type:
undefined
Mol. Mass.:
52607.65
Organism:
Homo sapiens (Human)
Description:
P28223
Residue:
471
  
Inhibitor
Name:
BDBM50399616
Synonyms:
CHEMBL2181188
Type:
Small organic molecule
Emp. Form.:
C22H25ClN2O
Mol. Mass.:
368.9
SMILES:
CCCN1CCC(COc2nc3c(Cl)cccc3c3ccccc23)CC1
: