Target
5-hydroxytryptamine receptor 2C
Ligand
BDBM50399614
Substrate
Meas. Tech.
ChEMBL_878524 (CHEMBL2188189)
Ki
492±n/a nM
Citation
 Dubost, EDumas, NFossey, CMagnelli, RButt-Gueulle, SBallandonne, CCaignard, DHDulin, FSopkova de-Oliveira Santos, JMillet, PCharnay, YRault, SCailly, TFabis, F Synthesis and structure-affinity relationships of selective high-affinity 5-HT(4) receptor antagonists: application to the design of new potential single photon emission computed tomography tracers. J Med Chem 55:9693-707 (2012)  
Target
Name:
5-hydroxytryptamine receptor 2C
Synonyms:
5-HT-2C 5-HT2C-INI 5-HTR2C 5-hydroxytryptamine receptor 2C (5-HT-2C) 5HT-1C HTR1C Serotonin (5-HT3) receptor Serotonin Receptor 2C
Type:
G Protein-Coupled Receptor (GPCR)
Mol. Mass.:
51836.79
Organism:
Homo sapiens (Human)
Description:
P28335
Residue:
458
  
Inhibitor
Name:
BDBM50399614
Synonyms:
CHEMBL2181170
Type:
Small organic molecule
Emp. Form.:
C21H24FN3O
Mol. Mass.:
353.4332
SMILES:
CCCN1CCC(COc2nc3c(F)cccc3c3ncccc23)CC1
: