Target
5-hydroxytryptamine receptor 2B
Ligand
BDBM50399614
Substrate
Meas. Tech.
ChEMBL_878525 (CHEMBL2188190)
Ki
136±n/a nM
Citation
 Dubost, EDumas, NFossey, CMagnelli, RButt-Gueulle, SBallandonne, CCaignard, DHDulin, FSopkova de-Oliveira Santos, JMillet, PCharnay, YRault, SCailly, TFabis, F Synthesis and structure-affinity relationships of selective high-affinity 5-HT(4) receptor antagonists: application to the design of new potential single photon emission computed tomography tracers. J Med Chem 55:9693-707 (2012)  
Target
Name:
5-hydroxytryptamine receptor 2B
Synonyms:
5-HT-2B 5-hydroxytryptamine (serotonin) receptor 2B [Homo sapiens] 5-hydroxytryptamine receptor 2C (5HT2C) HTR2B Serotonin 2b (5-HT2b) receptor | Serotonin Receptor 2B
Type:
G Protein-Coupled Receptor (GPCR)
Mol. Mass.:
54312.47
Organism:
Homo sapiens (Human)
Description:
Receptor binding assays were performed using human clone stably expressed in CHO cells.
Residue:
481
  
Inhibitor
Name:
BDBM50399614
Synonyms:
CHEMBL2181170
Type:
Small organic molecule
Emp. Form.:
C21H24FN3O
Mol. Mass.:
353.4332
SMILES:
CCCN1CCC(COc2nc3c(F)cccc3c3ncccc23)CC1
: