Target
3-phosphoinositide-dependent protein kinase 1
Ligand
BDBM50399647
Substrate
Meas. Tech.
ChEMBL_878675 (CHEMBL2182499)
EC50
60000±n/a nM
Citation
 Wilhelm, ALopez-Garcia, LABusschots, KFröhner, WMaurer, FBoettcher, SZhang, HSchulze, JOBiondi, RMEngel, M 2-(3-Oxo-1,3-diphenylpropyl)malonic acids as potent allosteric ligands of the PIF pocket of phosphoinositide-dependent kinase-1: development and prodrug concept. J Med Chem 55:9817-30 (2012)  
Target
Name:
3-phosphoinositide-dependent protein kinase 1
Synonyms:
3-Phosphoinositide-Dependent Protein Kinase 1 (PDK1) 3-phosphoinositide-dependent protein kinase 1 3-phosphoinositide-dependent protein kinase 1 (PDK-1) Isoform 2 of 3-phosphoinositide-dependent protein kinase 1 PDPK1 Phosphoinositide-dependent protein kinase 1 (PDK1) hPDK1
Type:
Enzyme
Mol. Mass.:
63157.65
Organism:
Homo sapiens (Human)
Description:
O15530
Residue:
556
  
Inhibitor
Name:
BDBM50399647
Synonyms:
CHEMBL2177670
Type:
Small organic molecule
Emp. Form.:
C18H15IO5
Mol. Mass.:
438.2132
SMILES:
OC(=O)C(C(CC(=O)c1ccc(I)cc1)c1ccccc1)C(O)=O
: