Target
Lysosomal acid glucosylceramidase
Ligand
BDBM18361
Substrate
Meas. Tech.
ChEMBL_878843 (CHEMBL2184151)
IC50
120000±n/a nM
Citation
 Kato, AHayashi, EMiyauchi, SAdachi, IImahori, TNatori, YYoshimura, YNash, RJShimaoka, HNakagome, IKoseki, JHirono, STakahata, H a-1-C-butyl-1,4-dideoxy-1,4-imino-l-arabinitol as a second-generation iminosugar-based orala-glucosidase inhibitor for improving postprandial hyperglycemia. J Med Chem 55:10347-62 (2012)  
Target
Name:
Lysosomal acid glucosylceramidase
Synonyms:
Acid beta-glucosidase GBA GBA1_BOVIN | Glucosylceramidase
Type:
PROTEIN
Mol. Mass.:
59862.93
Organism:
Bos taurus
Description:
ChEMBL_1460504
Residue:
536
  
Inhibitor
Name:
BDBM18361
Synonyms:
(2R,3S,4R,5R,6R)-2-butyl-6-(hydroxymethyl)piperidine-3,4,5-triol | alpha-1-C-Butyl-DNJ
Type:
Small organic molecule
Emp. Form.:
C10H21NO4
Mol. Mass.:
219.278
SMILES:
CCCC[C@H]1N[C@H](CO)[C@@H](O)[C@H](O)[C@H]1O
: