Target
TGF-beta receptor type-2
Ligand
BDBM50399828
Substrate
Meas. Tech.
ChEMBL_877385 (CHEMBL2182430)
IC50
400±n/a nM
Citation
 Schade, DLanier, MWillems, EOkolotowicz, KBushway, PWahlquist, CGilley, CMercola, MCashman, JR Synthesis and SAR of b-annulated 1,4-dihydropyridines define cardiomyogenic compounds as novel inhibitors of TGFß signaling. J Med Chem 55:9946-57 (2012)  
Target
Name:
TGF-beta receptor type-2
Synonyms:
TGF-beta receptor type II TGFR2_HUMAN
Type:
PROTEIN
Mol. Mass.:
64559.49
Organism:
Homo sapiens (Human)
Description:
ChEMBL_586859
Residue:
567
  
Inhibitor
Name:
BDBM50399828
Synonyms:
CHEMBL2180268
Type:
Small organic molecule
Emp. Form.:
C27H29NO3
Mol. Mass.:
415.5241
SMILES:
CCCC1CC(=O)C2C(C(C(=O)OC)=C(C)N=C2C1)c1ccc(cc1)-c1ccccc1
: