Target
G-protein coupled bile acid receptor 1
Ligand
BDBM50399966
Substrate
Meas. Tech.
ChEMBL_877859 (CHEMBL2187733)
EC50
6.2±n/a nM
Citation
 Duan, HNing, MChen, XZou, QZhang, LFeng, YZhang, LLeng, YShen, J Design, synthesis, and antidiabetic activity of 4-phenoxynicotinamide and 4-phenoxypyrimidine-5-carboxamide derivatives as potent and orally efficacious TGR5 agonists. J Med Chem 55:10475-89 (2012)  
Target
Name:
G-protein coupled bile acid receptor 1
Synonyms:
GPBAR_MOUSE M-BAR Tgr5
Type:
PROTEIN
Mol. Mass.:
35665.78
Organism:
Mus musculus
Description:
ChEMBL_1475560
Residue:
329
  
Inhibitor
Name:
BDBM50399966
Synonyms:
CHEMBL2181226
Type:
Small organic molecule
Emp. Form.:
C25H25N3O2
Mol. Mass.:
399.4849
SMILES:
Cc1ccc(C)c(Oc2ccncc2C(=O)N2CCN(C3CC3)c3ccccc23)c1
: