Target
G-protein coupled bile acid receptor 1
Ligand
BDBM50399969
Substrate
Meas. Tech.
ChEMBL_877860 (CHEMBL2187734)
EC50
0.46±n/a nM
Citation
 Duan, HNing, MChen, XZou, QZhang, LFeng, YZhang, LLeng, YShen, J Design, synthesis, and antidiabetic activity of 4-phenoxynicotinamide and 4-phenoxypyrimidine-5-carboxamide derivatives as potent and orally efficacious TGR5 agonists. J Med Chem 55:10475-89 (2012)  
Target
Name:
G-protein coupled bile acid receptor 1
Synonyms:
BG37 GPBAR_HUMAN TGR5 hGPCR19
Type:
G Protein-Coupled Receptor (GPCR)
Mol. Mass.:
35260.02
Organism:
Homo sapiens (Human)
Description:
CHO cells transiently transfected with hTGR5.
Residue:
330
  
Inhibitor
Name:
BDBM50399969
Synonyms:
CHEMBL2181227
Type:
Small organic molecule
Emp. Form.:
C23H18Cl3N3O2
Mol. Mass.:
474.767
SMILES:
Clc1cc(Cl)c(Oc2ccncc2C(=O)N2CCN(C3CC3)c3ccccc23)cc1Cl
: