Target
Amine oxidase [flavin-containing] A
Ligand
BDBM50400121
Substrate
Meas. Tech.
ChEMBL_878115 (CHEMBL2183305)
Ki
0.006±n/a nM
Citation
 Abdelhafez, OMAmin, KMAli, HIAbdalla, MMBatran, RZ Synthesis of new 7-oxycoumarin derivatives as potent and selective monoamine oxidase A inhibitors. J Med Chem 55:10424-36 (2012)  
Target
Name:
Amine oxidase [flavin-containing] A
Synonyms:
AOFA_BOVIN MAO-A Monoamine Oxidase Type A (MAO-A) Monoamine oxidase A | Monoamine oxidase type A
Type:
PROTEIN
Mol. Mass.:
59764.63
Organism:
Bos taurus
Description:
ChEMBL_1501477
Residue:
527
  
Inhibitor
Name:
BDBM50400121
Synonyms:
CHEMBL2178430
Type:
Small organic molecule
Emp. Form.:
C20H23N3O4S2
Mol. Mass.:
433.544
SMILES:
Cc1c(C)c(=O)oc2cc(OCc3nnc(SCCN4CCOCC4)s3)ccc12
: