Target
Free fatty acid receptor 1
Ligand
BDBM50386790
Substrate
Meas. Tech.
ChEMBL_872315 (CHEMBL2187414)
Ki
38±n/a nM
Citation
 Negoro, NSasaki, SMikami, SIto, MSuzuki, MTsujihata, YIto, RHarada, ATakeuchi, KSuzuki, NMiyazaki, JSantou, TOdani, TKanzaki, NFunami, MTanaka, TKogame, AMatsunaga, SYasuma, TMomose, Y Discovery of TAK-875: A Potent, Selective, and Orally Bioavailable GPR40 Agonist. ACS Med Chem Lett 1:290-294 (2010)  
Target
Name:
Free fatty acid receptor 1
Synonyms:
FFAR1 G-protein Coupled Receptor 40 | GPR40
Type:
G Protein-Coupled Receptor (GPCR)
Mol. Mass.:
31473.32
Organism:
Homo sapiens (Human)
Description:
O14842
Residue:
300
  
Inhibitor
Name:
BDBM50386790
Synonyms:
CHEMBL1829174 TAK-875
Type:
Small organic molecule
Emp. Form.:
C29H32O7S
Mol. Mass.:
524.625
SMILES:
Cc1cc(OCCCS(C)(=O)=O)cc(C)c1-c1cccc(COc2ccc3[C@H](CC(O)=O)COc3c2)c1
: