Target
Bombesin receptor subtype-3
Ligand
BDBM50400239
Substrate
Meas. Tech.
ChEMBL_872481 (CHEMBL2182521)
IC50
10±n/a nM
Citation
 Liu, PLanza, TJChioda, MJones, CChobanian, HRGuo, YChang, LKelly, TMKan, YPalyha, OGuan, XMMarsh, DJMetzger, JMRamsay, KWang, SPStrack, AMMiller, RPang, JLyons, KDragovic, JNing, JGSchafer, WAWelch, CJGong, XGao, YDHornak, VBall, RGTsou, NReitman, MLWyvratt, MJNargund, RPLin, LS Discovery of benzodiazepine sulfonamide-based bombesin receptor subtype 3 agonists and their unusual chirality. ACS Med Chem Lett 2:933-937 (2011)  
Target
Name:
Bombesin receptor subtype-3
Synonyms:
BRS-3 BRS3_HUMAN Bombesin like receptor 3
Type:
Enzyme Catalytic Domain
Mol. Mass.:
44424.45
Organism:
Homo sapiens (Human)
Description:
Bombesin 3 BRS3 HUMAN::P32247
Residue:
399
  
Inhibitor
Name:
BDBM50400239
Synonyms:
CHEMBL2179480
Type:
Small organic molecule
Emp. Form.:
C20H15F6N3O2S2
Mol. Mass.:
507.472
SMILES:
Cc1ccc2Nc3nc(ccc3CN(c2c1C)S(=O)(=O)c1ccc(s1)C(F)(F)F)C(F)(F)F
: