Target
DNA gyrase subunit B
Ligand
BDBM50330317
Substrate
Meas. Tech.
ChEMBL_872079 (CHEMBL2184195)
Kd
1.2±n/a nM
Citation
 Škedelj, VTomašic, TMašic, LPZega, A ATP-binding site of bacterial enzymes as a target for antibacterial drug design. J Med Chem 54:915-29 (2011)  
Target
Name:
DNA gyrase subunit B
Synonyms:
Type:
PROTEIN
Mol. Mass.:
89969.34
Organism:
Escherichia coli
Description:
ChEMBL_872079
Residue:
804
  
Inhibitor
Name:
BDBM50330317
Synonyms:
5-Methyl-1H-pyrrole-2-carboxylic acid (3R,4S,5R,6S)-6-{8-chloro-4-hydroxy-3-[4-hydroxy-3-(3-methyl-but-2-enyl)-benzoylamino]-2-oxo-2H-chromen-7-yloxy}-5-hydroxy-3-methoxy-2,2-dimethyl-tetrahydro-pyran-4-yl ester CHEMBL303984 | Clorobiocin
Type:
Small organic molecule
Emp. Form.:
C35H37ClN2O11
Mol. Mass.:
697.128
SMILES:
CO[C@@H]1[C@@H](OC(=O)c2ccc(C)[nH]2)[C@@H](O)[C@H](Oc2ccc3c(O)c(NC(=O)c4ccc(O)c(CC=C(C)C)c4)c(=O)oc3c2Cl)OC1(C)C
: