Target
dTMP kinase
Ligand
BDBM50359622
Substrate
Meas. Tech.
ChEMBL_877484 (CHEMBL2183638)
Ki
25000±n/a nM
Citation
 Cui, HCarrero-Lérida, JSilva, APWhittingham, JLBrannigan, JARuiz-Pérez, LMRead, KDWilson, KSGonzález-Pacanowska, DGilbert, IH Synthesis and evaluation ofa-thymidine analogues as novel antimalarials. J Med Chem 55:10948-57 (2012)  
Target
Name:
dTMP kinase
Synonyms:
TMK | Thymidylate kinase, putative
Type:
PROTEIN
Mol. Mass.:
24691.81
Organism:
Plasmodium falciparum (isolate 3D7)
Description:
ChEMBL_877484
Residue:
210
  
Inhibitor
Name:
BDBM50359622
Synonyms:
CHEMBL1928432
Type:
Small organic molecule
Emp. Form.:
C18H18ClF3N4O4S
Mol. Mass.:
478.873
SMILES:
Cc1cn([C@H]2C[C@H](O)[C@@H](CNC(=S)Nc3ccc(Cl)c(c3)C(F)(F)F)O2)c(=O)[nH]c1=O
: