Target
Carbonic anhydrase 12
Ligand
BDBM50400503
Substrate
Meas. Tech.
ChEMBL_879404 (CHEMBL2208802)
Ki
79.8±n/a nM
Citation
 Brzozowski, ZSlawinski, JVullo, DSupuran, CT Carbonic anhydrase inhibitors. Regioselective synthesis of novel series 1-substituted 1,4-dihydro-4-oxo-3-pyridinesulfonamides and their inhibition of the human cytosolic isozymes I and II and transmembrane cancer-associated isozymes IX and XII. Eur J Med Chem 56:282-291 (2012)  
Target
Name:
Carbonic anhydrase 12
Synonyms:
CA-XII CAH12_HUMAN Carbonic anhydrase Carbonic anhydrase XII Carbonic anhydrase XII (CAXII) | Tumor antigen HOM-RCC-3.1.3
Type:
Enzyme
Mol. Mass.:
39456.00
Organism:
Homo sapiens (Human)
Description:
Catalytic domain of human cloned isozyme was used in the assay
Residue:
354
  
Inhibitor
Name:
BDBM50400503
Synonyms:
CHEMBL2203349
Type:
Small organic molecule
Emp. Form.:
C14H16N4O6S2
Mol. Mass.:
400.43
SMILES:
Cc1ccc(cc1)S(=O)(=O)NNC(=O)Cn1ccc(=O)c(c1)S(N)(=O)=O
: