Target
Aminopeptidase N
Ligand
BDBM50400551
Substrate
Meas. Tech.
ChEMBL_879874 (CHEMBL2211411)
IC50
980±n/a nM
Citation
 Su, LCao, JJia, YZhang, XFang, HXu, W Development of Synthetic Aminopeptidase N/CD13 Inhibitors to Overcome Cancer Metastasis and Angiogenesis. ACS Med Chem Lett 3:959-964 (2012)  
Target
Name:
Aminopeptidase N
Synonyms:
AMPN_PIG AP-M Alanyl aminopeptidase Aminopeptidase N (APN) Microsomal aminopeptidase pAPN
Type:
Protein
Mol. Mass.:
108810.25
Organism:
Sus scrofa (Pig)
Description:
P15145
Residue:
963
  
Inhibitor
Name:
BDBM50400551
Synonyms:
CHEMBL2205650
Type:
Small organic molecule
Emp. Form.:
C16H17N3O3
Mol. Mass.:
299.3245
SMILES:
ONC(=O)[C@@H](NC(=O)NCc1ccccc1)c1ccccc1
: