Target
Aminopeptidase N
Ligand
BDBM50400544
Substrate
Meas. Tech.
ChEMBL_879874 (CHEMBL2211411)
IC50
330±n/a nM
Citation
 Su, LCao, JJia, YZhang, XFang, HXu, W Development of Synthetic Aminopeptidase N/CD13 Inhibitors to Overcome Cancer Metastasis and Angiogenesis. ACS Med Chem Lett 3:959-964 (2012)  
Target
Name:
Aminopeptidase N
Synonyms:
AMPN_PIG AP-M Alanyl aminopeptidase Aminopeptidase N (APN) Microsomal aminopeptidase pAPN
Type:
Protein
Mol. Mass.:
108810.25
Organism:
Sus scrofa (Pig)
Description:
P15145
Residue:
963
  
Inhibitor
Name:
BDBM50400544
Synonyms:
CHEMBL2204947
Type:
Small organic molecule
Emp. Form.:
C14H21N3O3
Mol. Mass.:
279.3348
SMILES:
CC(C)C[C@H](NC(=O)Nc1ccc(C)cc1)C(=O)NO
: